BDBM50043350 10-[3-(3,4-Dimethoxy-phenyl)-propionyl]-1,8-dihydroxy-10H-anthracen-9-one::CHEMBL130792
SMILES COc1ccc(CCC(=O)C2c3cccc(O)c3C(=O)c3c(O)cccc23)cc1OC
InChI Key InChIKey=QCYXAWAWQQGZIC-UHFFFAOYSA-N
Data  1 IC50
  Tab Delimited (TSV)   2D SDfile   Computed 3D by Vconf -m prep SDfile
Find this compound or compounds like it in BindingDB:
Activity Spreadsheet -- Enzyme Inhibition Constant Data from BindingDB
Found 1 hit for monomerid = 50043350
Target5-lipoxygenase(Bos taurus)
UniversitäT Regensburg
Curated by ChEMBL
LigandPNGBDBM50043350(10-[3-(3,4-Dimethoxy-phenyl)-propionyl]-1,8-dihydr...)
Affinity DataIC50:  1.70E+4nM. Assay description: Inhibitory activity against 5-lipoxygenase (inhibition of 5-HETE and LTB4 biosynthesis) in bovine polymorphonuclear leukocytes (PMNL).
In DepthDetails ArticlePubMed