BDBM50043598 1N-[1-[1-carbamoyl-2-phenyl-(1S)-ethylcarbamoyl]-3-methyl-(1S)-butyl]-2-amino-4-methyl-(2R)-pentanamide::CHEMBL133199
SMILES CC(C)C[C@@H](N)C(=O)N[C@@H](CC(C)C)C(=O)N[C@@H](Cc1ccccc1)C(N)=O
InChI Key InChIKey=XFPUHEASCSXICK-SQNIBIBYSA-N
Data  1 IC50
  Tab Delimited (TSV)   2D SDfile   Computed 3D by Vconf -m prep SDfile
Find this compound or compounds like it in BindingDB:
Activity Spreadsheet -- Enzyme Inhibition Constant Data from BindingDB
Found 1 hit for monomerid = 50043598
TargetInterstitial collagenase(Homo sapiens (Human))
Merck Research Laboratories
Curated by ChEMBL
LigandPNGBDBM50043598(1N-[1-[1-carbamoyl-2-phenyl-(1S)-ethylcarbamoyl]-3...)
Affinity DataIC50: >1.00E+5nM. Assay description: Inhibition of human fibroblast collagenase
In DepthDetails ArticlePubMed