BDBM50044179 CHEMBL3314002::US10301272, Example 7/4
SMILES CCC(C)(C)NS(=O)(=O)c1ccc(-c2sc(nc2CC2CCCCC2)C(=O)N[C@H]2C[C@@H](C2)C(O)=O)c(Cl)c1C
InChI Key InChIKey=QLKWBZGQDXUAPZ-WGSAOQKQSA-N
Data  5 IC50  2 Kd  3 EC50
  Tab Delimited (TSV)   2D SDfile   Computed 3D by Vconf -m prep SDfile
Find this compound or compounds like it in BindingDB:
Activity Spreadsheet -- Enzyme Inhibition Constant Data from BindingDB
Found 10 hits for monomerid = 50044179
TargetNuclear receptor ROR-gamma(Homo sapiens (Human))
Genentech
Curated by ChEMBL
LigandPNGBDBM50044179(CHEMBL3314002 | US10301272, Example 7/4)
Affinity DataEC50:  1nM. Assay description: Agonist activity at RoRc-LBD (unknown origin) expressed in HEK293 cells assessed as transcriptional activity by GAL4 reporter assay
In DepthDetails ArticlePubMed
TargetIsoform 2 of Nuclear receptor ROR-gamma (RORgT)(Homo sapiens (Human))
Phenex Pharmaceuticals
US Patent
LigandPNGBDBM50044179(CHEMBL3314002 | US10301272, Example 7/4)
Affinity DataIC50:  251nM. Assay description: Determination of a ligand mediated Gal4 promoter driven transactivation to quantify ligand binding to RORγ was performed as follows: DNA encodin...
In DepthDetails US Patent
TargetIsoform 2 of Nuclear receptor ROR-gamma (RORgT)(Homo sapiens (Human))
Phenex Pharmaceuticals
US Patent
LigandPNGBDBM50044179(CHEMBL3314002 | US10301272, Example 7/4)
Affinity DataIC50:  1nM. Assay description: Cells were incubated for additional 16 h before firefly (FF) luciferase activities were measured sequentially in the same cell extract using a Dual-L...
In DepthDetails US Patent
TargetIsoform 2 of Nuclear receptor ROR-gamma (RORgT)(Homo sapiens (Human))
Phenex Pharmaceuticals
US Patent
LigandPNGBDBM50044179(CHEMBL3314002 | US10301272, Example 7/4)
Affinity DataIC50:  1nM. Assay description: Cells were incubated for additional 16 h before renilla (REN) luciferase activities were measured sequentially in the same cell extract using a Dual-...
In DepthDetails US Patent
TargetNuclear receptor ROR-beta(Homo sapiens (Human))
Phenex Pharmaceuticals
Curated by ChEMBL
LigandPNGBDBM50044179(CHEMBL3314002 | US10301272, Example 7/4)
Affinity DataIC50:  326nM. Assay description: Inverse agonist activity at human GAL4 DBD-fused RORbeta LBD (201 to 452 residues) expressed in HEK293T cells assessed as reduction in ROR mediated t...
In DepthDetails ArticlePubMed
TargetNuclear receptor ROR-gamma(Homo sapiens (Human))
Genentech
Curated by ChEMBL
LigandPNGBDBM50044179(CHEMBL3314002 | US10301272, Example 7/4)
Affinity DataIC50:  1.10nM. Assay description: Inverse agonist activity at human GAL4 DBD-fused RORgammat LBD (237 to 497 residues) expressed in HEK293T cells assessed as reduction in ROR mediated...
In DepthDetails ArticlePubMed
TargetNuclear receptor ROR-gamma(Homo sapiens (Human))
Genentech
Curated by ChEMBL
LigandPNGBDBM50044179(CHEMBL3314002 | US10301272, Example 7/4)
Affinity DataKd:  0.0500nM. Assay description: Binding affinity to recombinant human RORgamma LBD (237 to 497 residues) expressed in Escherichia coli BL21 (DE3) GOLD by 1,8-ANS dye-based thermoflu...
In DepthDetails ArticlePubMed
TargetNuclear receptor ROR-gamma(Homo sapiens (Human))
Genentech
Curated by ChEMBL
LigandPNGBDBM50044179(CHEMBL3314002 | US10301272, Example 7/4)
Affinity DataEC50:  77nM. Assay description: Inverse agonist activity at RORgammat in human whole blood assessed as reduction in IL17A production
In DepthDetails ArticlePubMed
TargetNuclear receptor ROR-beta(Homo sapiens (Human))
Phenex Pharmaceuticals
Curated by ChEMBL
LigandPNGBDBM50044179(CHEMBL3314002 | US10301272, Example 7/4)
Affinity DataKd:  660nM. Assay description: Binding affinity to recombinant human RORbeta LBD (201 to 452 residues) expressed in Escherichia coli BL21 (DE3) GOLD by 1,8-ANS dye-based thermofluo...
In DepthDetails ArticlePubMed
TargetNuclear receptor ROR-gamma(Homo sapiens (Human))
Genentech
Curated by ChEMBL
LigandPNGBDBM50044179(CHEMBL3314002 | US10301272, Example 7/4)
Affinity DataEC50:  1.30nM. Assay description: Binding affinity to recombinant human RORgamma LBD (237 to 497 residues) expressed in Escherichia coli BL21 (DE3) GOLD by 1,8-ANS dye-based thermoflu...
In DepthDetails ArticlePubMed