BDBM50044226 1-hydroxy-1-phenylethyl-phosphinoylamino]-propionyl-pyrrolidine-2-carboxylic acid::CHEMBL62955::Compound 16
SMILES CC(NP(O)(=O)CCc1ccccc1)C(=O)N1CCCC1C(O)=O
InChI Key InChIKey=VUEMZVPEAVUVHY-UHFFFAOYSA-N
Data  2 IC50
  Tab Delimited (TSV)   2D SDfile   Computed 3D by Vconf -m prep SDfile
Find this compound or compounds like it in BindingDB:
Activity Spreadsheet -- Enzyme Inhibition Constant Data from BindingDB
Found 2 hits for monomerid = 50044226
TargetAngiotensin-converting enzyme(Homo sapiens (Human))
University Of Michigan
Curated by ChEMBL
LigandPNGBDBM50044226(1-hydroxy-1-phenylethyl-phosphinoylamino]-propiony...)
Affinity DataIC50:  25.1nM. Assay description: Inhibition of angiotensin I converting enzyme in silico
In DepthDetails ArticlePubMed
TargetThermolysin(Bacillus thermoproteolyticus)
Merck Research Laboratories
Curated by ChEMBL
LigandPNGBDBM50044226(1-hydroxy-1-phenylethyl-phosphinoylamino]-propiony...)
Affinity DataIC50:  7nM. Assay description: Inhibition of metallopeptidase thermolysin
In DepthDetails ArticlePubMed