BDBM50044421 2-{4-[1-(2,4-Diamino-pteridin-6-ylmethyl)-butyl]-benzoylamino}-pentanedioic acid::CHEMBL72898
SMILES CCCC(Cc1cnc2nc(N)nc(N)c2n1)c1ccc(cc1)C(=O)NC(CCC(O)=O)C(O)=O
InChI Key InChIKey=VIBFQIZOMPFURO-UHFFFAOYSA-N
Data  1 KI
  Tab Delimited (TSV)   2D SDfile   Computed 3D by Vconf -m prep SDfile
Find this compound or compounds like it in BindingDB:
Activity Spreadsheet -- Enzyme Inhibition Constant Data from BindingDB
Found 1 hit for monomerid = 50044421
TargetDihydrofolate reductase(Mus musculus (Mouse))
Sri International
Curated by ChEMBL
LigandPNGBDBM50044421(2-{4-[1-(2,4-Diamino-pteridin-6-ylmethyl)-butyl]-b...)
Affinity DataKi:  0.00900nM. Assay description: Inhibition of Dihydrofolate reductase (DHFR) enzyme derived from L1210 cells expressed as Ki (pM)
In DepthDetails ArticlePubMed