BDBM50044555 CHEMBL3341957
SMILES CCCc1c(C(O)=O)c(O)cc2C(=O)c3cccc(O)c3C(=O)c12
InChI Key InChIKey=FNFBCXUSCQLQFP-UHFFFAOYSA-N
Data  2 IC50
  Tab Delimited (TSV)   2D SDfile   Computed 3D by Vconf -m prep SDfile
Find this compound or compounds like it in BindingDB:
Activity Spreadsheet -- Enzyme Inhibition Constant Data from BindingDB
Found 2 hits for monomerid = 50044555
TargetTranscription factor Jun(Rattus norvegicus)
University Of Texas Medical Branch
Curated by ChEMBL
LigandPNGBDBM50044555(CHEMBL3341957)
Affinity DataIC50:  6.00E+4nM. Assay description: Inhibition of AP-1-mediated collagenase production in IL1alpha-stimulated Lewis rat synovial cells
In DepthDetails ArticlePubMed
TargetTranscription factor Jun(Homo sapiens (Human))
University Of Texas Medical Branch
Curated by ChEMBL
LigandPNGBDBM50044555(CHEMBL3341957)
Affinity DataIC50:  1.00E+5nM. Assay description: Inhibition of AP-1 (unknown origin) binding to AP-1 oligonucleotide by gel shift assay
In DepthDetails ArticlePubMed