BDBM50044574 CHEMBL3341910
SMILES FC(F)(F)c1ccc2Nc3nc(Cl)ncc3C(=O)Nc2c1
InChI Key InChIKey=WANKECNDCCJFKC-UHFFFAOYSA-N
Data  1 IC50
  Tab Delimited (TSV)   2D SDfile   Computed 3D by Vconf -m prep SDfile
Find this compound or compounds like it in BindingDB:
Activity Spreadsheet -- Enzyme Inhibition Constant Data from BindingDB
Found 1 hit for monomerid = 50044574
TargetTranscription factor Jun(Homo sapiens (Human))
University Of Texas Medical Branch
Curated by ChEMBL
LigandPNGBDBM50044574(CHEMBL3341910)
Affinity DataIC50:  1.00E+4nM. Assay description: Inhibition of AP-1-mediated transcriptional activation in human Jurkat cells by luciferase reporter gene assay
In DepthDetails ArticlePubMed