BDBM50044723 1-[2-(3,4-Dichloro-phenyl)-ethyl]-4-ethyl-piperazine::CHEMBL311621
SMILES CCN1CCN(CCc2ccc(Cl)c(Cl)c2)CC1
InChI Key InChIKey=QMQXJRFQVWMGCW-UHFFFAOYSA-N
Data  1 KI
  Tab Delimited (TSV)   2D SDfile   Computed 3D by Vconf -m prep SDfile
Find this compound or compounds like it in BindingDB:
Activity Spreadsheet -- Enzyme Inhibition Constant Data from BindingDB
Found 1 hit for monomerid = 50044723
TargetSigma non-opioid intracellular receptor 1(Homo sapiens (Human))
National Institute Of Diabetes And Digestive And Kidney Diseases
Curated by ChEMBL
LigandPNGBDBM50044723(1-[2-(3,4-Dichloro-phenyl)-ethyl]-4-ethyl-piperazi...)
Affinity DataKi:  1.60nM. Assay description: Ability to displace [3H](+)-pentazocine at sigma receptor in guinea pig brain membrane was determined
In DepthDetails ArticlePubMed