BDBM50045002 CHEMBL3310403
SMILES Cc1sc(nc1CC(=O)NCCc1ccccn1)-c1ncc(C#N)c(C)c1O
InChI Key InChIKey=CXHVPJXEVMGIEH-UHFFFAOYSA-N
Data  1 IC50
  Tab Delimited (TSV)   2D SDfile   Computed 3D by Vconf -m prep SDfile
Find this compound or compounds like it in BindingDB:
Activity Spreadsheet -- Enzyme Inhibition Constant Data from BindingDB
Found 1 hit for monomerid = 50045002
TargetEgl nine homolog 1(Homo sapiens (Human))
Sungkyunkwan University
Curated by ChEMBL
LigandPNGBDBM50045002(CHEMBL3310403)
Affinity DataIC50:  800nM. Assay description: Inhibition of PHD2 in human Hep3B cells assessed as erythropoietin secretion by ELISA
In DepthDetails ArticlePubMed