BDBM50045096 3-[3-(2-Carboxy-ethyl)-4-decyloxy-benzoyl]-benzoic acid::CHEMBL48068::LY-213024
SMILES CCCCCCCCCCOc1ccc(cc1CCC(O)=O)C(=O)c1cccc(c1)C(O)=O
InChI Key InChIKey=CMMZAOHHIRUNGK-UHFFFAOYSA-N
Data  1 IC50
  Tab Delimited (TSV)   2D SDfile   Computed 3D by Vconf -m prep SDfile
Find this compound or compounds like it in BindingDB:
Activity Spreadsheet -- Enzyme Inhibition Constant Data from BindingDB
Found 1 hit for monomerid = 50045096
TargetLeukotriene B4 receptor 1(Homo sapiens (Human))
Eli Lilly
Curated by ChEMBL
LigandPNGBDBM50045096(3-[3-(2-Carboxy-ethyl)-4-decyloxy-benzoyl]-benzoic...)
Affinity DataIC50:  210nM. Assay description: Inhibition of specific binding of LTB4 ( 0.1 nM) to receptors on intact human neutrophils
In DepthDetails ArticlePubMed