BDBM50045344 4-(1-Allyl-3,7-dimethyl-2,6-dioxo-2,3,6,7-tetrahydro-1H-purin-8-yl)-benzenesulfonic acid::CHEMBL88584
SMILES Cn1c(nc2n(C)c(=O)n(CC=C)c(=O)c12)-c1ccc(cc1)S(O)(=O)=O
InChI Key InChIKey=CDMZOKMMANFJMU-UHFFFAOYSA-N
Data  1 KI
  Tab Delimited (TSV)   2D SDfile   Computed 3D by Vconf -m prep SDfile
Find this compound or compounds like it in BindingDB:
Activity Spreadsheet -- Enzyme Inhibition Constant Data from BindingDB
Found 1 hit for monomerid = 50045344
TargetAdenosine receptor A2a(Rattus norvegicus (rat))
National Institutes Of Health
Curated by ChEMBL
LigandPNGBDBM50045344(4-(1-Allyl-3,7-dimethyl-2,6-dioxo-2,3,6,7-tetrahyd...)
Affinity DataKi:  2.70E+4nM. Assay description: Binding affinity for adenosine A2A receptor from rat brain membranes using [3H]-CGS-21,680
In DepthDetails ArticlePubMed