BDBM50045353 1,7-Diallyl-3-methyl-8-phenyl-3,7-dihydro-purine-2,6-dione::CHEMBL89274
SMILES Cn1c2nc(-c3ccccc3)n(CC=C)c2c(=O)n(CC=C)c1=O
InChI Key InChIKey=FUBHRVDPCGNSSD-UHFFFAOYSA-N
Data  2 KI
  Tab Delimited (TSV)   2D SDfile   Computed 3D by Vconf -m prep SDfile
Find this compound or compounds like it in BindingDB:
Activity Spreadsheet -- Enzyme Inhibition Constant Data from BindingDB
Found 2 hits for monomerid = 50045353
TargetAdenosine receptor A1(Rattus norvegicus (rat))
National Institutes Of Health
Curated by ChEMBL
LigandPNGBDBM50045353(1,7-Diallyl-3-methyl-8-phenyl-3,7-dihydro-purine-2...)
Affinity DataKi:  660nM. Assay description: Binding affinity for adenosine A1 receptor from rat brain membranes using [3H]-PIA as radioligand
In DepthDetails ArticlePubMed
TargetAdenosine receptor A2a(Rattus norvegicus (rat))
National Institutes Of Health
Curated by ChEMBL
LigandPNGBDBM50045353(1,7-Diallyl-3-methyl-8-phenyl-3,7-dihydro-purine-2...)
Affinity DataKi:  7.70E+3nM. Assay description: Binding affinity for adenosine A2A receptor from rat brain membranes using [3H]-CGS-21,680
In DepthDetails ArticlePubMed