BDBM50045401 17-Hydroxy-2-methanesulfonyl-10,13-dimethyl-tetradecahydro-20-oxa-cyclopropa[4,5]cyclopenta[a]phenanthren-3-one::CHEMBL3137862
SMILES [H][C@@]12CC[C@H](O)[C@@]1(C)CC[C@@]1([H])[C@@]2([H])CC[C@]23OC2C(=O)C(C[C@]13C)S(C)(=O)=O
InChI Key InChIKey=FELAYLQGNMVPPT-HOARYHOPSA-N
Data  1 IC50
  Tab Delimited (TSV)   2D SDfile   Computed 3D by Vconf -m prep SDfile
Find this compound or compounds like it in BindingDB:
Activity Spreadsheet -- Enzyme Inhibition Constant Data from BindingDB
Found 1 hit for monomerid = 50045401
TargetProtein Tat(Human immunodeficiency virus type 1 (isolate PCV12...)
Sterling Winthrop Pharmaceuticals Research Division
Curated by ChEMBL
LigandPNGBDBM50045401(17-Hydroxy-2-methanesulfonyl-10,13-dimethyl-tetrad...)
Affinity DataIC50:  8.40E+3nM. Assay description: Inhibition of HIV-1 nuclear regulatory protein Tat
In DepthDetails ArticlePubMed