BDBM50045479 CHEMBL3310110
SMILES Cl.[#7]\[#6](-[#7])=[#7]/[#6](=O)-c1ccc-2c(c1)-[#6](-[#8])-c1cc(Cl)ccc-21
InChI Key InChIKey=RCDPDAUUEOMCMF-UHFFFAOYSA-N
Data  2 KI
  Tab Delimited (TSV)   2D SDfile   Computed 3D by Vconf -m prep SDfile
Find this compound or compounds like it in BindingDB:
Activity Spreadsheet -- Enzyme Inhibition Constant Data from BindingDB
Found 2 hits for monomerid = 50045479
Target5-hydroxytryptamine receptor 2B(Homo sapiens (Human))
Astellas Pharma
Curated by ChEMBL
LigandPNGBDBM50045479(CHEMBL3310110)
Affinity DataKi:  1.70nM. Assay description: Displacement of [3H]Mesulergine from human 5-HT2B receptor expressed in HEK293-EBNA cells by liquid scintillation counting
In DepthDetails ArticlePubMed
Target5-hydroxytryptamine receptor 7(Homo sapiens (Human))
Astellas Pharma
Curated by ChEMBL
LigandPNGBDBM50045479(CHEMBL3310110)
Affinity DataKi: >1.00E+3nM. Assay description: Displacement of [3H]HT from human 5-HT7 receptor expressed in CHO cells by liquid scintillation counting
In DepthDetails ArticlePubMed