BDBM50045483 CHEMBL3310119
SMILES Cl.[#6]-[#6](=O)-[#7]-[#6]-1-c2ccccc2-c2ccc(cc-12)-[#6](=O)\[#7]=[#6](\[#7])-[#7]
InChI Key InChIKey=XAKKQSXMZRIZNZ-UHFFFAOYSA-N
Data  2 KI
  Tab Delimited (TSV)   2D SDfile   Computed 3D by Vconf -m prep SDfile
Find this compound or compounds like it in BindingDB:
Activity Spreadsheet -- Enzyme Inhibition Constant Data from BindingDB
Found 2 hits for monomerid = 50045483
Target5-hydroxytryptamine receptor 2B(Homo sapiens (Human))
Astellas Pharma
Curated by ChEMBL
LigandPNGBDBM50045483(CHEMBL3310119)
Affinity DataKi:  34nM. Assay description: Displacement of [3H]Mesulergine from human 5-HT2B receptor expressed in HEK293-EBNA cells by liquid scintillation counting
In DepthDetails ArticlePubMed
Target5-hydroxytryptamine receptor 7(Homo sapiens (Human))
Astellas Pharma
Curated by ChEMBL
LigandPNGBDBM50045483(CHEMBL3310119)
Affinity DataKi:  180nM. Assay description: Displacement of [3H]HT from human 5-HT7 receptor expressed in CHO cells by liquid scintillation counting
In DepthDetails ArticlePubMed