BDBM50045761 3-[1-(2-Hydroxy-2-phenyl-ethyl)-3,4-dimethyl-piperidin-4-yl]-phenol::CHEMBL95935
SMILES C[C@H]1CN(CC(O)c2ccccc2)CC[C@@]1(C)c1cccc(O)c1
InChI Key InChIKey=UJTGLABUUULACG-RBEDQOGGSA-N
Data  4 KI
  Tab Delimited (TSV)   2D SDfile   Computed 3D by Vconf -m prep SDfile
Find this compound or compounds like it in BindingDB:
Activity Spreadsheet -- Enzyme Inhibition Constant Data from BindingDB
Found 4 hits for monomerid = 50045761
TargetKappa-type opioid receptor(Cavia porcellus (domestic guinea pig))
Eli Lilly
Curated by ChEMBL
LigandPNGBDBM50045761(3-[1-(2-Hydroxy-2-phenyl-ethyl)-3,4-dimethyl-piper...)
Affinity DataKi:  34nM. Assay description: Binding affinity towards mu-opioid receptor by displacement of [3H]-NAL at 10 nM from rat brain homogenates
In DepthDetails ArticlePubMed
TargetMu-type opioid receptor(Rattus norvegicus (rat))
Eli Lilly
Curated by ChEMBL
LigandPNGBDBM50045761(3-[1-(2-Hydroxy-2-phenyl-ethyl)-3,4-dimethyl-piper...)
Affinity DataKi:  48nM. Assay description: Binding affinity towards mu-opioid receptor by displacement of [3H]-NAL at 10 nM from rat brain homogenates
In DepthDetails ArticlePubMed
TargetKappa-type opioid receptor(Cavia porcellus (domestic guinea pig))
Eli Lilly
Curated by ChEMBL
LigandPNGBDBM50045761(3-[1-(2-Hydroxy-2-phenyl-ethyl)-3,4-dimethyl-piper...)
Affinity DataKi:  70nM. Assay description: Binding affinity towards kappa-opioid receptor by displacement of [3H]-EKC at 100 nM from guinea pig cortical tissue
In DepthDetails ArticlePubMed
TargetMu-type opioid receptor(Rattus norvegicus (rat))
Eli Lilly
Curated by ChEMBL
LigandPNGBDBM50045761(3-[1-(2-Hydroxy-2-phenyl-ethyl)-3,4-dimethyl-piper...)
Affinity DataKi:  97nM. Assay description: Binding affinity towards kappa-opioid receptor by displacement of [3H]-EKC at 10 nM from guinea pig cortical tissue
In DepthDetails ArticlePubMed