BDBM50045771 3-{1-[2-(2-Chloro-phenyl)-ethyl]-3,4-dimethyl-piperidin-4-yl}-phenol::CHEMBL317766
SMILES C[C@H]1CN(CCc2ccccc2Cl)CC[C@@]1(C)c1cccc(O)c1
InChI Key InChIKey=YKTDTTMIGUBDKC-HRAATJIYSA-N
Data  3 KI
  Tab Delimited (TSV)   2D SDfile   Computed 3D by Vconf -m prep SDfile
Find this compound or compounds like it in BindingDB:
Activity Spreadsheet -- Enzyme Inhibition Constant Data from BindingDB
Found 3 hits for monomerid = 50045771
TargetMu-type opioid receptor(Rattus norvegicus (rat))
Eli Lilly
Curated by ChEMBL
LigandPNGBDBM50045771(3-{1-[2-(2-Chloro-phenyl)-ethyl]-3,4-dimethyl-pipe...)
Affinity DataKi:  3.5nM. Assay description: Binding affinity towards mu opioid receptor by displacement of [3H]-NAL from rat brain homogenates
In DepthDetails ArticlePubMed
TargetKappa-type opioid receptor(Cavia porcellus (domestic guinea pig))
Eli Lilly
Curated by ChEMBL
LigandPNGBDBM50045771(3-{1-[2-(2-Chloro-phenyl)-ethyl]-3,4-dimethyl-pipe...)
Affinity DataKi:  55nM. Assay description: Binding affinity towards mu-opioid receptor by displacement of [3H]-NAL at 10 nM from rat brain homogenates
In DepthDetails ArticlePubMed
TargetKappa-type opioid receptor(Cavia porcellus (domestic guinea pig))
Eli Lilly
Curated by ChEMBL
LigandPNGBDBM50045771(3-{1-[2-(2-Chloro-phenyl)-ethyl]-3,4-dimethyl-pipe...)
Affinity DataKi:  83nM. Assay description: Binding affinity towards kappa-opioid receptor by displacement of [3H]-EKC at 100 nM from guinea pig cortical tissue
In DepthDetails ArticlePubMed