BDBM50045989 4-{4-[Cyano-(2-methyl-pyridin-3-yl)-methyl]-piperazin-1-yl}-N-methyl-4-oxo-2-phenyl-butyramide::CHEMBL103546
SMILES CNC(=O)C(CC(=O)N1CCN(CC1)C(C#N)c1cccnc1C)c1ccccc1
InChI Key InChIKey=PZGKQRVXSWMARS-UHFFFAOYSA-N
Data  1 IC50
  Tab Delimited (TSV)   2D SDfile   Computed 3D by Vconf -m prep SDfile
Find this compound or compounds like it in BindingDB:
Activity Spreadsheet -- Enzyme Inhibition Constant Data from BindingDB
Found 1 hit for monomerid = 50045989
TargetPlatelet-activating factor receptor(Cavia porcellus)
J. Uriach & CíA.
Curated by ChEMBL
LigandPNGBDBM50045989(4-{4-[Cyano-(2-methyl-pyridin-3-yl)-methyl]-pipera...)
Affinity DataIC50:  1.52E+4nM. Assay description: Inhibition of PAF-induced platelet aggregation
In DepthDetails ArticlePubMed