BDBM50045996 CHEMBL101794::[4-(3,3-Diphenyl-propionyl)-piperazin-1-yl]-(2-methyl-pyridin-3-yl)-acetic acid ethyl ester
SMILES CCOC(=O)C(N1CCN(CC1)C(=O)CC(c1ccccc1)c1ccccc1)c1cccnc1C
InChI Key InChIKey=MVMBBKRFSZGQCC-UHFFFAOYSA-N
Data  1 IC50
  Tab Delimited (TSV)   2D SDfile   Computed 3D by Vconf -m prep SDfile
Find this compound or compounds like it in BindingDB:
Activity Spreadsheet -- Enzyme Inhibition Constant Data from BindingDB
Found 1 hit for monomerid = 50045996
TargetPlatelet-activating factor receptor(Cavia porcellus)
J. Uriach & CíA.
Curated by ChEMBL
LigandPNGBDBM50045996(CHEMBL101794 | [4-(3,3-Diphenyl-propionyl)-piperaz...)
Affinity DataIC50:  1.55E+4nM. Assay description: In vitro inhibition of PAF-induced platelet aggregation in male rabbits
In DepthDetails ArticlePubMed