BDBM50046060 5-(5,8-Dihydroxy-naphthalen-2-yl)-2-hydroxy-benzoic acid::CHEMBL100446
SMILES OC(=O)c1cc(ccc1O)-c1ccc2c(O)ccc(O)c2c1
InChI Key InChIKey=GUEWNLOSODPWHP-UHFFFAOYSA-N
Data  1 IC50
  Tab Delimited (TSV)   2D SDfile   Computed 3D by Vconf -m prep SDfile
Find this compound or compounds like it in BindingDB:
Activity Spreadsheet -- Enzyme Inhibition Constant Data from BindingDB
Found 1 hit for monomerid = 50046060
TargetTyrosine-protein kinase Lck(Homo sapiens (Human))
National Institutes Of Health
Curated by ChEMBL
LigandPNGBDBM50046060(5-(5,8-Dihydroxy-naphthalen-2-yl)-2-hydroxy-benzoi...)
Affinity DataIC50:  6.50E+4nM. Assay description: Inhibition of protein-tyrosine kinase p56lck
In DepthDetails ArticlePubMed