BDBM50046310 8-(4-Chloro-benzenesulfonylamino)-4-[2-(pyridin-3-yloxy)-ethyl]-octanoic acid::CHEMBL302970
SMILES OC(=O)CC[C@@H](CCCCNS(=O)(=O)c1ccc(Cl)cc1)CCOc1cccnc1
InChI Key InChIKey=KHAXNTUCMDVAPK-QGZVFWFLSA-N
Data  1 IC50
  Tab Delimited (TSV)   2D SDfile   Computed 3D by Vconf -m prep SDfile
Find this compound or compounds like it in BindingDB:
Activity Spreadsheet -- Enzyme Inhibition Constant Data from BindingDB
Found 1 hit for monomerid = 50046310
TargetThromboxane-A synthase(Homo sapiens (Human))
Ciba-Geigy
Curated by ChEMBL
LigandPNGBDBM50046310(8-(4-Chloro-benzenesulfonylamino)-4-[2-(pyridin-3-...)
Affinity DataIC50:  13nM. Assay description: In vitro inhibition of thromboxane synthasase in microsomal platelet preparation
In DepthDetails ArticlePubMed