BDBM50046311 8-(4-Chloro-benzenesulfonylamino)-4-(3-pyridin-3-yl-propyl)-octanoic acid::CHEMBL65187
SMILES OC(=O)CC[C@@H](CCCCNS(=O)(=O)c1ccc(Cl)cc1)CCCc1cccnc1
InChI Key InChIKey=ISMHAZMNDUAHLK-SFHVURJKSA-N
Data  1 IC50
  Tab Delimited (TSV)   2D SDfile   Computed 3D by Vconf -m prep SDfile
Find this compound or compounds like it in BindingDB:
Activity Spreadsheet -- Enzyme Inhibition Constant Data from BindingDB
Found 1 hit for monomerid = 50046311
TargetThromboxane-A synthase(Homo sapiens (Human))
Ciba-Geigy
Curated by ChEMBL
LigandPNGBDBM50046311(8-(4-Chloro-benzenesulfonylamino)-4-(3-pyridin-3-y...)
Affinity DataIC50:  4.5nM. Assay description: In vitro inhibition of thromboxane synthasase in microsomal platelet preparation
In DepthDetails ArticlePubMed