BDBM50046380 CHEMBL112546::{1-[1-Benzyl-3-(2-benzyloxycarbonylamino-3-methyl-butyrylamino)-2-hydroxy-4-phenyl-butylcarbamoyl]-2-methyl-propyl}-carbamic acid pyridin-4-ylmethyl ester
SMILES CC(C)[C@@H](NC(=O)OCc1ccccc1)C(=O)N[C@@H](Cc1ccccc1)[C@H](O)[C@H](Cc1ccccc1)NC(=O)[C@@H](NC(=O)OCc1ccncc1)C(C)C
InChI Key InChIKey=DSDWCXRXVMLBOA-ILOBPARPSA-N
Data  1 IC50
  Tab Delimited (TSV)   2D SDfile   Computed 3D by Vconf -m prep SDfile
Find this compound or compounds like it in BindingDB:
Activity Spreadsheet -- Enzyme Inhibition Constant Data from BindingDB
Found 1 hit for monomerid = 50046380
TargetGag-Pol polyprotein [489-587](Human immunodeficiency virus type 1)
Abbott Laboratories
Curated by ChEMBL
LigandPNGBDBM50046380(CHEMBL112546 | {1-[1-Benzyl-3-(2-benzyloxycarbonyl...)
Affinity DataIC50:  7nM. Assay description: Inhibition of purified recombinant HIV-1 protease in a fluorogenic assay
In DepthDetails ArticlePubMed