BDBM50046398 1N-[1-benzyl-2-hydroxy-3-[2-methyl-1-methyl(2-pyridylmethyl)aminosulfomoyl-(1R)-propylcarboxamido]-4-phenyl-(1S,3S)-butyl]-3-methyl-2-methyl(2-pyridylmethyl)aminosulfomoyl-(2S)-butanamide::CHEMBL325673
SMILES CC(C)[C@H](NS(=O)(=O)N(C)Cc1ccccn1)C(=O)N[C@@H](Cc1ccccc1)C(O)[C@H](Cc1ccccc1)NC(=O)[C@H](NS(=O)(=O)N(C)Cc1ccccn1)C(C)C
InChI Key InChIKey=CRZJCRABSGTTKW-FJGHDBNBSA-N
Data  1 IC50
  Tab Delimited (TSV)   2D SDfile   Computed 3D by Vconf -m prep SDfile
Find this compound or compounds like it in BindingDB:
Activity Spreadsheet -- Enzyme Inhibition Constant Data from BindingDB
Found 1 hit for monomerid = 50046398
TargetGag-Pol polyprotein [489-587](Human immunodeficiency virus type 1)
Abbott Laboratories
Curated by ChEMBL
LigandPNGBDBM50046398(1N-[1-benzyl-2-hydroxy-3-[2-methyl-1-methyl(2-pyri...)
Affinity DataIC50:  1.30E+3nM. Assay description: Inhibition of purified recombinant HIV-1 protease in a fluorogenic assay
In DepthDetails ArticlePubMed