BDBM50046403 CHEMBL442010::N-(1-Benzyl-2,3-dihydroxy-4-{3-methyl-2-[3-methyl-3-(2-pyridin-2-yl-ethyl)-ureido]-butyrylamino}-5-phenyl-pentyl)-3-methyl-2-[3-methyl-3-(2-pyridin-2-yl-ethyl)-ureido]-butyramide
SMILES CC(C)[C@H](NC(=O)N(C)CCc1ccccn1)C(=O)N[C@@H](Cc1ccccc1)[C@@H](O)[C@@H](O)[C@H](Cc1ccccc1)NC(=O)[C@H](NC(=O)N(C)CCc1ccccn1)C(C)C
InChI Key InChIKey=ALUYKRIZHOPUSY-NCRKLPSZSA-N
Data  1 IC50
  Tab Delimited (TSV)   2D SDfile   Computed 3D by Vconf -m prep SDfile
Find this compound or compounds like it in BindingDB:
Activity Spreadsheet -- Enzyme Inhibition Constant Data from BindingDB
Found 1 hit for monomerid = 50046403
TargetGag-Pol polyprotein [489-587](Human immunodeficiency virus type 1)
Abbott Laboratories
Curated by ChEMBL
LigandPNGBDBM50046403(CHEMBL442010 | N-(1-Benzyl-2,3-dihydroxy-4-{3-meth...)
Affinity DataIC50:  22nM. Assay description: Inhibition of purified recombinant HIV-1 protease in a fluorogenic assay
In DepthDetails ArticlePubMed