BDBM50046428 CHEMBL112930::N-{1-Benzyl-2,3-dihydroxy-4-[3-methyl-2-(2-pyridin-2-yl-ethanesulfonylamino)-butyrylamino]-5-phenyl-pentyl}-3-methyl-2-(2-pyridin-2-yl-ethanesulfonylamino)-butyramide
SMILES CC(C)[C@H](NS(=O)(=O)CCc1ccccn1)C(=O)N[C@@H](Cc1ccccc1)[C@H](O)[C@H](O)[C@H](Cc1ccccc1)NC(=O)[C@H](NS(=O)(=O)CCc1ccccn1)C(C)C
InChI Key InChIKey=KLRIZXBSDAYEGJ-AKUVXLQWSA-N
Data  1 IC50
  Tab Delimited (TSV)   2D SDfile   Computed 3D by Vconf -m prep SDfile
Find this compound or compounds like it in BindingDB:
Activity Spreadsheet -- Enzyme Inhibition Constant Data from BindingDB
Found 1 hit for monomerid = 50046428
TargetGag-Pol polyprotein [489-587](Human immunodeficiency virus type 1)
Abbott Laboratories
Curated by ChEMBL
LigandPNGBDBM50046428(CHEMBL112930 | N-{1-Benzyl-2,3-dihydroxy-4-[3-meth...)
Affinity DataIC50:  1.60nM. Assay description: Inhibition of purified recombinant HIV-1 protease in a fluorogenic assay
In DepthDetails ArticlePubMed