BDBM50046444 CHEMBL110603::{1-[1-Benzyl-3-(2-benzyloxycarbonylamino-3-methyl-butyrylamino)-2-hydroxy-4-phenyl-butylcarbamoyl]-2-methyl-propyl}-carbamic acid 1-methyl-piperidin-2-ylmethyl ester
SMILES CC(C)[C@H](NC(=O)OCC1CCCCN1C)C(=O)N[C@@H](Cc1ccccc1)[C@@H](O)[C@H](Cc1ccccc1)NC(=O)[C@H](NC(=O)OCc1ccccc1)C(C)C
InChI Key InChIKey=NPNDZQKGYRYMJV-WCIUPFQRSA-N
Data  1 IC50
  Tab Delimited (TSV)   2D SDfile   Computed 3D by Vconf -m prep SDfile
Find this compound or compounds like it in BindingDB:
Activity Spreadsheet -- Enzyme Inhibition Constant Data from BindingDB
Found 1 hit for monomerid = 50046444
TargetGag-Pol polyprotein [489-587](Human immunodeficiency virus type 1)
Abbott Laboratories
Curated by ChEMBL
LigandPNGBDBM50046444(CHEMBL110603 | {1-[1-Benzyl-3-(2-benzyloxycarbonyl...)
Affinity DataIC50:  63nM. Assay description: Inhibition of purified recombinant HIV-1 protease in a fluorogenic assay
In DepthDetails ArticlePubMed