BDBM50046641 1R,2R-trans-2-(Ethyl-hydroxycarbamoylmethyl-carbamoyl)-cyclohexanecarboxylic acid::1R,2S-cis-2-(Ethyl-hydroxycarbamoylmethyl-carbamoyl)-cyclohexanecarboxylic acid::1S,2R-cis-2-(Ethyl-hydroxycarbamoylmethyl-carbamoyl)-cyclohexanecarboxylic acid::1S,2S-trans-2-(Ethyl-hydroxycarbamoylmethyl-carbamoyl)-cyclohexanecarboxylic acid::CHEMBL349351::Cis-2-(Ethyl-hydroxycarbamoylmethyl-carbamoyl)-cyclohexanecarboxylic acid::Trans-2-(Ethyl-hydroxycarbamoylmethyl-carbamoyl)-cyclohexanecarboxylic acid
SMILES CCN(CC(=O)NO)C(=O)C1CCCCC1C(O)=O
InChI Key InChIKey=HFYNEGDIVGRLAN-UHFFFAOYSA-N
Data  2 IC50
  Tab Delimited (TSV)   2D SDfile   Computed 3D by Vconf -m prep SDfile
Find this compound or compounds like it in BindingDB:
Activity Spreadsheet -- Enzyme Inhibition Constant Data from BindingDB
Found 2 hits for monomerid = 50046641
TargetAngiotensin-converting enzyme(Rattus norvegicus)
Laboratori Guidotti
Curated by ChEMBL
LigandPNGBDBM50046641(1R,2R-trans-2-(Ethyl-hydroxycarbamoylmethyl-carbam...)
Affinity DataIC50:  2.90E+3nM. Assay description: In vitro inhibitory activity against rat serum angiotensin I converting enzyme using hippuryl-glycyl-glycine as substrate
In DepthDetails ArticlePubMed
TargetAngiotensin-converting enzyme(Rattus norvegicus)
Laboratori Guidotti
Curated by ChEMBL
LigandPNGBDBM50046641(1R,2R-trans-2-(Ethyl-hydroxycarbamoylmethyl-carbam...)
Affinity DataIC50:  14nM. Assay description: In vitro inhibitory activity against rat serum angiotensin I converting enzyme using hippuryl-glycyl-glycine as substrate
In DepthDetails ArticlePubMed