BDBM50046777 2-Benzyl-N-[1-(1-cyclohexylmethyl-2,3-dihydroxy-5-methyl-hexylcarbamoyl)-2-(1-methyl-1H-imidazol-4-yl)-ethyl]-4-morpholin-4-yl-4-oxo-butyramide::CHEMBL342462
SMILES CC(C)C[C@H](O)[C@H](O)[C@H](CC1CCCCC1)NC(=O)[C@H](Cc1cn(C)cn1)NC(=O)[C@@H](CC(=O)N1CCOCC1)Cc1ccccc1
InChI Key InChIKey=DSZGOKARGFBAHP-YVNNRUMDSA-N
Data  1 IC50
  Tab Delimited (TSV)   2D SDfile   Computed 3D by Vconf -m prep SDfile
Find this compound or compounds like it in BindingDB:
Activity Spreadsheet -- Enzyme Inhibition Constant Data from BindingDB
Found 1 hit for monomerid = 50046777
TargetRenin(Homo sapiens (Human))
Abbott Laboratories
Curated by ChEMBL
LigandPNGBDBM50046777(2-Benzyl-N-[1-(1-cyclohexylmethyl-2,3-dihydroxy-5-...)
Affinity DataIC50:  110nMpH: 7.4Assay Description:Inhibition of human plasma renin at pH 7.4
In DepthDetails ArticlePubMed