BDBM50046789 2-Benzyl-N-[1-(1-cyclohexylmethyl-2,3-dihydroxy-5-methyl-hexylcarbamoyl)-2-thiophen-2-yl-ethyl]-4-(4-methyl-piperazin-1-yl)-4-oxo-butyramide::CHEMBL441292
SMILES CC(C)C[C@H](O)[C@H](O)[C@H](CC1CCCCC1)NC(=O)[C@H](Cc1cccs1)NC(=O)[C@@H](CC(=O)N1CCN(C)CC1)Cc1ccccc1
InChI Key InChIKey=KMZTXQXBVGHHBX-AJISXOSTSA-N
Data  1 IC50
  Tab Delimited (TSV)   2D SDfile   Computed 3D by Vconf -m prep SDfile
Find this compound or compounds like it in BindingDB:
Activity Spreadsheet -- Enzyme Inhibition Constant Data from BindingDB
Found 1 hit for monomerid = 50046789
TargetRenin(Homo sapiens (Human))
Abbott Laboratories
Curated by ChEMBL
LigandPNGBDBM50046789(2-Benzyl-N-[1-(1-cyclohexylmethyl-2,3-dihydroxy-5-...)
Affinity DataIC50:  110nMpH: 7.4Assay Description:Inhibition of human plasma renin at pH 7.4
In DepthDetails ArticlePubMed