BDBM50047472 (R)-N-tert-Butyl-3-[4-(2-methoxy-phenyl)-piperazin-1-yl]-2-phenyl-propionamide::CHEMBL22564::N-tert-Butyl-3-[4-(2-methoxy-phenyl)-piperazin-1-yl]-2-phenyl-propionamide::WAY-100135
SMILES COc1ccccc1N1CCN(CC(C(=O)NC(C)(C)C)c2ccccc2)CC1
InChI Key InChIKey=UMTDAKAAYOXIKU-UHFFFAOYSA-N
Data  2 IC50
  Tab Delimited (TSV)   2D SDfile   Computed 3D by Vconf -m prep SDfile
Find this compound or compounds like it in BindingDB:
Activity Spreadsheet -- Enzyme Inhibition Constant Data from BindingDB
Found 2 hits for monomerid = 50047472
TargetAlpha-1A/Alpha-1B/Alpha-1D adrenergic receptor(Rattus norvegicus (rat))
Wyeth Research (Uk)
Curated by ChEMBL
LigandPNGBDBM50047472((R)-N-tert-Butyl-3-[4-(2-methoxy-phenyl)-piperazin...)
Affinity DataIC50:  1.49E+3nM. Assay description: In vitro binding affinity towards the anor-adrenergic alpha-1 receptor at 10 e-6 M
In DepthDetails ArticlePubMed
Target5-hydroxytryptamine receptor 1A(Rattus norvegicus (rat))
Wyeth Research (Uk)
Curated by ChEMBL
LigandPNGBDBM50047472((R)-N-tert-Butyl-3-[4-(2-methoxy-phenyl)-piperazin...)
Affinity DataIC50:  34nM. Assay description: In vitro binding affinity towards the 5-hydroxytryptamine 1A receptor was evaluated
In DepthDetails ArticlePubMed