BDBM50047727 CHEMBL152057::[2-(3-Iodo-phenyl)-ethyl]-methyl-(2-pyrrolidin-1-yl-ethyl)-amine
SMILES CN(CCN1CCCC1)CCc1cccc(I)c1
InChI Key InChIKey=ZEXAWTKRIHYTFO-UHFFFAOYSA-N
Data  1 KI
  Tab Delimited (TSV)   2D SDfile   Computed 3D by Vconf -m prep SDfile
Find this compound or compounds like it in BindingDB:
Activity Spreadsheet -- Enzyme Inhibition Constant Data from BindingDB
Found 1 hit for monomerid = 50047727
TargetSigma non-opioid intracellular receptor 1(Homo sapiens (Human))
National Institute Of Diabetes And Digestive And Kidney Diseases
Curated by ChEMBL
LigandPNGBDBM50047727(CHEMBL152057 | [2-(3-Iodo-phenyl)-ethyl]-methyl-(2...)
Affinity DataKi:  2.5nM. Assay description: Binding affinity was evaluated against sigma-1 binding site in guinea pig,using [3H]- -(+)- Pentazocine
In DepthDetails ArticlePubMed