BDBM50047731 2-[1-(2-{[5-(3-Hydroxy-piperidin-1-ylmethyl)-furan-2-ylmethyl]-amino}-ethyl)-imidazolidin-2-ylidene]-malononitrile::CHEMBL152260
SMILES OC1CCCN(Cc2ccc(CNCCN3CCN=C3C(C#N)C#N)o2)C1
InChI Key InChIKey=NAEDTBKTERMLAY-UHFFFAOYSA-N
Data  1 IC50
  Tab Delimited (TSV)   2D SDfile   Computed 3D by Vconf -m prep SDfile
Find this compound or compounds like it in BindingDB:
Activity Spreadsheet -- Enzyme Inhibition Constant Data from BindingDB
Found 1 hit for monomerid = 50047731
TargetAcetylcholinesterase(Homo sapiens (Human))
Kyowa Hakko Kogyo
Curated by ChEMBL
LigandPNGBDBM50047731(2-[1-(2-{[5-(3-Hydroxy-piperidin-1-ylmethyl)-furan...)
Affinity DataIC50:  370nM. Assay description: Inhibition of guinea pig acetylcholinesterase
In DepthDetails ArticlePubMed