BDBM50047756 2-({2-[(5-Methoxymethyl-furan-2-ylmethyl)-amino]-ethylamino}-methylamino-methylene)-malononitrile::CHEMBL155495
SMILES COCc1ccc(CNCCNC(=NC)C(C#N)C#N)o1
InChI Key InChIKey=BJRCXGGODMLTGV-UHFFFAOYSA-N
Data  1 IC50
  Tab Delimited (TSV)   2D SDfile   Computed 3D by Vconf -m prep SDfile
Find this compound or compounds like it in BindingDB:
Activity Spreadsheet -- Enzyme Inhibition Constant Data from BindingDB
Found 1 hit for monomerid = 50047756
TargetAcetylcholinesterase(Homo sapiens (Human))
Kyowa Hakko Kogyo
Curated by ChEMBL
LigandPNGBDBM50047756(2-({2-[(5-Methoxymethyl-furan-2-ylmethyl)-amino]-e...)
Affinity DataIC50: >2.00E+4nM. Assay description: Inhibition of guinea pig acetylcholinesterase
In DepthDetails ArticlePubMed