BDBM50047802 CHEMBL157597::N-[4-(3-Ethylsulfanyl-5-trifluoromethyl-[1,2,4]triazol-4-ylmethyl)-phenyl]-phthalamic acid
SMILES CCSc1nnc(n1Cc1ccc(NC(=O)c2ccccc2C(O)=O)cc1)C(F)(F)F
InChI Key InChIKey=RSPASKIUYBLNFR-UHFFFAOYSA-N
Data  2 IC50
  Tab Delimited (TSV)   2D SDfile   Computed 3D by Vconf -m prep SDfile
Find this compound or compounds like it in BindingDB:
Activity Spreadsheet -- Enzyme Inhibition Constant Data from BindingDB
Found 2 hits for monomerid = 50047802
LigandPNGBDBM50047802(CHEMBL157597 | N-[4-(3-Ethylsulfanyl-5-trifluorome...)
Affinity DataIC50:  4.80E+3nM. Assay description: Antagonist activity at AT1 receptor in Oryctolagus cuniculus (rabbit) aorta
In DepthDetails Article
LigandPNGBDBM50047802(CHEMBL157597 | N-[4-(3-Ethylsulfanyl-5-trifluorome...)
Affinity DataIC50:  4.80E+3nM. Assay description: Displacement of [125I]-Sar1-Ile8-A II at the rabbit aorta angiotensin II receptor, type 1
In DepthDetails ArticlePubMed