BDBM50047820 5-[4'-(3-Butyl-5-isobutylsulfanyl-[1,2,4]triazol-4-ylmethyl)-biphenyl-2-yl]-1H-tetrazole::CHEMBL345181
SMILES CCCCc1nnc(SCC(C)C)n1Cc1ccc(cc1)-c1ccccc1-c1nnn[nH]1
InChI Key InChIKey=LJUIJNVLUFWXTG-UHFFFAOYSA-N
Data  1 IC50
  Tab Delimited (TSV)   2D SDfile   Computed 3D by Vconf -m prep SDfile
Find this compound or compounds like it in BindingDB:
Activity Spreadsheet -- Enzyme Inhibition Constant Data from BindingDB
Found 1 hit for monomerid = 50047820
TargetType-1 angiotensin II receptor(RABBIT)
Merck Research Laboratories
Curated by ChEMBL
LigandPNGBDBM50047820(5-[4'-(3-Butyl-5-isobutylsulfanyl-[1,2,4]triazol-4...)
Affinity DataIC50:  72nM. Assay description: Displacement of [125I]-Sar1-Ile8-A II at the rabbit aorta angiotensin II receptor, type 1
In DepthDetails ArticlePubMed