BDBM50047890 1-Butyl-4-hydroxy-2-oxo-1,2-dihydro-quinoline-3-carboxylic acid 8-methyl-8-aza-bicyclo[3.2.1]oct-3-yl ester::CHEMBL155697
SMILES CCCCn1c2ccccc2c(O)c(C(=O)OC2CC3CCC(C2)N3C)c1=O
InChI Key InChIKey=NTTDPWHRILLPCL-UHFFFAOYSA-N
Data  1 KI
  Tab Delimited (TSV)   2D SDfile   Computed 3D by Vconf -m prep SDfile
Find this compound or compounds like it in BindingDB:
Activity Spreadsheet -- Enzyme Inhibition Constant Data from BindingDB
Found 1 hit for monomerid = 50047890
Target5-hydroxytryptamine receptor 3A/3B(Rattus norvegicus)
Kyowa Hakko Kogyo
Curated by ChEMBL
LigandPNGBDBM50047890(1-Butyl-4-hydroxy-2-oxo-1,2-dihydro-quinoline-3-ca...)
Affinity DataKi: >100nM. Assay description: Binding affinity against radioligand [3H]quipazine labeled 5-hydroxytryptamine 3 receptor sites in neuroblastoma-glioma (NG108-15) cells.
In DepthDetails ArticlePubMed