BDBM50047895 CHEMBL158588::N-(4,8-Dimethyl-nona-3,7-dienyl)-N-methyl-N'-(3,7,11-trimethyl-dodeca-2,6,10-trienyl)-formamidine
SMILES [#6]-[#7](-[#6]-[#6]\[#6]=[#6](/[#6])-[#6]-[#6]\[#6]=[#6](\[#6])-[#6])\[#6]=[#7]\[#6]\[#6]=[#6](/[#6])-[#6]-[#6]\[#6]=[#6](/[#6])-[#6]-[#6]\[#6]=[#6](\[#6])-[#6]
InChI Key InChIKey=PYSOMVKWLNTIIA-IMGWONPXSA-N
Data  2 IC50
  Tab Delimited (TSV)   2D SDfile   Computed 3D by Vconf -m prep SDfile
Find this compound or compounds like it in BindingDB:
Activity Spreadsheet -- Enzyme Inhibition Constant Data from BindingDB
Found 2 hits for monomerid = 50047895
TargetSqualene synthase(Rattus norvegicus)
Sandoz Research Institute
Curated by ChEMBL
LigandPNGBDBM50047895(CHEMBL158588 | N-(4,8-Dimethyl-nona-3,7-dienyl)-N-...)
Affinity DataIC50:  6.90E+3nM. Assay description: Inhibitory activity against squalene synthetase in rat liver microsomal assay
In DepthDetails ArticlePubMed
TargetSqualene synthase(Rattus norvegicus)
Sandoz Research Institute
Curated by ChEMBL
LigandPNGBDBM50047895(CHEMBL158588 | N-(4,8-Dimethyl-nona-3,7-dienyl)-N-...)
Affinity DataIC50:  100nM. Assay description: Inhibitory activity against squalene synthetase in the presence of inorganic pyrophosphate in rat liver microsomal assay
In DepthDetails ArticlePubMed