BDBM50048089 CHEMBL3311518
SMILES OC[C@@H]1N[C@@H](CCCCc2ccc(F)cc2)[C@H](O)[C@H]1O
InChI Key InChIKey=NCIBNAATYWGBOH-AJNGGQMLSA-N
Data  3 IC50
  Tab Delimited (TSV)   2D SDfile   Computed 3D by Vconf -m prep SDfile
Find this compound or compounds like it in BindingDB:
Activity Spreadsheet -- Enzyme Inhibition Constant Data from BindingDB
Found 3 hits for monomerid = 50048089
TargetLysosomal alpha-glucosidase(Rattus norvegicus)
Tohoku Pharmaceutical University
Curated by ChEMBL
LigandPNGBDBM50048089(CHEMBL3311518)
Affinity DataIC50:  180nM. Assay description: Inhibition of Wistar rat intestinal maltase assessed as inhibition of D-glucose release after 30 mins by spectrophotometry
In DepthDetails ArticlePubMed
TargetSucrase-isomaltase, intestinal(Rattus norvegicus (Rat))
Tohoku Pharmaceutical University
Curated by ChEMBL
LigandPNGBDBM50048089(CHEMBL3311518)
Affinity DataIC50:  170nM. Assay description: Inhibition of Wistar rat intestinal sucrase assessed as inhibition of D-glucose release after 30 mins by spectrophotometry
In DepthDetails ArticlePubMed
TargetSucrase-isomaltase, intestinal(Rattus norvegicus (Rat))
Tohoku Pharmaceutical University
Curated by ChEMBL
LigandPNGBDBM50048089(CHEMBL3311518)
Affinity DataIC50:  3.00E+3nM. Assay description: Inhibition of Wistar rat intestinal isomaltase assessed as inhibition of D-glucose release after 30 mins by spectrophotometry
In DepthDetails ArticlePubMed