BDBM50048517 CHEMBL318096::[(3S,7R)-3-((S)-2-Mercapto-3-phenyl-propionylamino)-7-methyl-2-oxo-azepan-1-yl]-acetic acid
SMILES C[C@@H]1CCC[C@H](NC(=O)[C@@H](S)Cc2ccccc2)C(=O)N1CC(O)=O
InChI Key InChIKey=YABBNBJGWCCRTE-SNPRPXQTSA-N
Data  4 IC50
  Tab Delimited (TSV)   2D SDfile   Computed 3D by Vconf -m prep SDfile
Find this compound or compounds like it in BindingDB:
Activity Spreadsheet -- Enzyme Inhibition Constant Data from BindingDB
Found 4 hits for monomerid = 50048517
TargetAngiotensin-converting enzyme(Oryctolagus cuniculus)
Bristol-Myers Squibb Pharmaceutical Research Institute
Curated by ChEMBL
LigandPNGBDBM50048517(CHEMBL318096 | [(3S,7R)-3-((S)-2-Mercapto-3-phenyl...)
Affinity DataIC50:  16nM. Assay description: In vitro inhibition of Angiotensin I converting enzyme isolated from rabbit lung extract.
In DepthDetails ArticlePubMed
TargetAngiotensin-converting enzyme(Oryctolagus cuniculus)
Bristol-Myers Squibb Pharmaceutical Research Institute
Curated by ChEMBL
LigandPNGBDBM50048517(CHEMBL318096 | [(3S,7R)-3-((S)-2-Mercapto-3-phenyl...)
Affinity DataIC50:  16nM. Assay description: In vitro inhibitory activity against Angiotensin I converting enzyme (ACE) isolated from rabbit lung extract using hippuryl-L-histidyl-L-leucine (HHL...
In DepthDetails ArticlePubMed
TargetNeprilysin(Rattus norvegicus (Rat))
The Bristol-Myers Squibb Pharmaceutical Research Institute
Curated by ChEMBL
LigandPNGBDBM50048517(CHEMBL318096 | [(3S,7R)-3-((S)-2-Mercapto-3-phenyl...)
Affinity DataIC50:  149nM. Assay description: In vitro inhibitory activity against purified rat kidney neutral endopeptidase (NEP) using a fluorometric assay with dansyl-Gly-Phe-Arg as the substr...
In DepthDetails ArticlePubMed
TargetNeprilysin(Rattus norvegicus (Rat))
The Bristol-Myers Squibb Pharmaceutical Research Institute
Curated by ChEMBL
LigandPNGBDBM50048517(CHEMBL318096 | [(3S,7R)-3-((S)-2-Mercapto-3-phenyl...)
Affinity DataIC50:  149nM. Assay description: In vitro inhibition of purified rat kidney Neutral endopeptidase.
In DepthDetails ArticlePubMed