BDBM50048561 8-(2-Fluoro-ethyl)-3-(4-iodo-phenyl)-8-aza-bicyclo[3.2.1]octane-2-carboxylic acid methyl ester::CHEMBL358006
SMILES COC(=O)C1C2CCC(CC1c1ccc(I)cc1)N2CCF
InChI Key InChIKey=CCWXJQJFBKJFEZ-UHFFFAOYSA-N
Data  3 KI
  Tab Delimited (TSV)   2D SDfile   Computed 3D by Vconf -m prep SDfile
Find this compound or compounds like it in BindingDB:
Activity Spreadsheet -- Enzyme Inhibition Constant Data from BindingDB
Found 3 hits for monomerid = 50048561
TargetSodium-dependent serotonin transporter(Rattus norvegicus (rat))
Research Biochemicals International
Curated by ChEMBL
LigandPNGBDBM50048561(8-(2-Fluoro-ethyl)-3-(4-iodo-phenyl)-8-aza-bicyclo...)
Affinity DataKi:  0.140nM. Assay description: In vitro binding affinity towards serotonin transporter in rat cerebral cortical homogenates by [3H]paroxetine displacement.
In DepthDetails ArticlePubMed
TargetSodium-dependent dopamine transporter(Rattus norvegicus (rat))
Research Biochemicals International
Curated by ChEMBL
LigandPNGBDBM50048561(8-(2-Fluoro-ethyl)-3-(4-iodo-phenyl)-8-aza-bicyclo...)
Affinity DataKi:  4nM. Assay description: In vitro binding affinity towards dopamine transporter in rat striatal membranes by [3H]GBR-12395 displacement.
In DepthDetails ArticlePubMed
TargetTransporter(Rattus norvegicus)
Research Biochemicals International
Curated by ChEMBL
LigandPNGBDBM50048561(8-(2-Fluoro-ethyl)-3-(4-iodo-phenyl)-8-aza-bicyclo...)
Affinity DataKi:  93nM. Assay description: In vitro binding affinity towards Norepinephrine transporter rat cerebral cortical homogenates by [3H]nisoxetine displacement.
In DepthDetails ArticlePubMed