BDBM50048831 CHEMBL50763::[3-(5-Cyclopropyl-[1,2,4]oxadiazol-3-yl)-6-fluoro-4H-imidazo[1,5-a]quinoxalin-5-yl]-morpholin-4-yl-methanone
SMILES Fc1cccc-2c1N(Cc1c(ncn-21)-c1noc(n1)C1CC1)C(=O)N1CCOCC1
InChI Key InChIKey=AJTIJRUGVRMRDN-UHFFFAOYSA-N
Data  3 KI
  Tab Delimited (TSV)   2D SDfile   Computed 3D by Vconf -m prep SDfile
Find this compound or compounds like it in BindingDB:
Activity Spreadsheet -- Enzyme Inhibition Constant Data from BindingDB
Found 3 hits for monomerid = 50048831
TargetGamma-aminobutyric acid receptor subunit alpha-1/beta-2/gamma-2(Homo sapiens (Human))
Upjohn Laboratories
Curated by ChEMBL
LigandPNGBDBM50048831(CHEMBL50763 | [3-(5-Cyclopropyl-[1,2,4]oxadiazol-3...)
Affinity DataKi:  0.170nM. Assay description: Displacement of [3H]Flunitrazepam from GABA-A receptor alpha-1-beta-2-gamma-2 subunits expressed in Sf9 cells
In DepthDetails ArticlePubMed
TargetGamma-aminobutyric acid receptor subunit alpha-3/beta-2/gamma-2(Homo sapiens (Human))
Upjohn Laboratories
Curated by ChEMBL
LigandPNGBDBM50048831(CHEMBL50763 | [3-(5-Cyclopropyl-[1,2,4]oxadiazol-3...)
Affinity DataKi:  0.510nM. Assay description: Displacement of [3H]flunitrazepam from GABA-A receptor alpha-3-beta-2-gamma-2 subunits expressed in Sf9 cells
In DepthDetails ArticlePubMed
TargetGamma-aminobutyric acid receptor subunit alpha-6/beta-2/gamma-2(Homo sapiens (Human))
Upjohn Laboratories
Curated by ChEMBL
LigandPNGBDBM50048831(CHEMBL50763 | [3-(5-Cyclopropyl-[1,2,4]oxadiazol-3...)
Affinity DataKi:  13nM. Assay description: Displacement of [3H]-Ro-15-4513 from GABA-A receptor alpha-6-beta-2-gamma-2 subunits expressed in Sf9 cells
In DepthDetails ArticlePubMed