BDBM50048925 4-(1-Butyl-2,4-dioxo-1,4-dihydro-2H-pteridin-3-yl)-butyric acid ethyl ester::CHEMBL352725
SMILES CCCCn1c2nccnc2c(=O)n(CCCC(=O)OCC)c1=O
InChI Key InChIKey=OEZUVFVPUUBTEN-UHFFFAOYSA-N
Data  1 IC50
  Tab Delimited (TSV)   2D SDfile   Computed 3D by Vconf -m prep SDfile
Find this compound or compounds like it in BindingDB:
Activity Spreadsheet -- Enzyme Inhibition Constant Data from BindingDB
Found 1 hit for monomerid = 50048925
TargetTumor necrosis factor(Homo sapiens (Human))
University Of California
Curated by ChEMBL
LigandPNGBDBM50048925(4-(1-Butyl-2,4-dioxo-1,4-dihydro-2H-pteridin-3-yl)...)
Affinity DataIC50:  1.50E+4nM. Assay description: TNF-alpha production in PBMC by ELISA method
In DepthDetails ArticlePubMed