BDBM50049177 (3R,4R)-3,4-Bis-(3,4-dihydroxy-benzyl)-dihydro-furan-2-one::(3R,4R)-3,4-bis(3,4-dihydroxybenzyl)dihydrofuran-2(3H)-one::CHEMBL369471
SMILES Oc1ccc(C[C@H]2COC(=O)[C@@H]2Cc2ccc(O)c(O)c2)cc1O
InChI Key InChIKey=NXJDDTDNGCHIGR-QWHCGFSZSA-N
Data  3 IC50
  Tab Delimited (TSV)   2D SDfile   Computed 3D by Vconf -m prep SDfile
Find this compound or compounds like it in BindingDB:
Activity Spreadsheet -- Enzyme Inhibition Constant Data from BindingDB
Found 3 hits for monomerid = 50049177
TargetIntegrase(Human immunodeficiency virus 1)
Freie UniversitäT Berlin
Curated by ChEMBL
LigandPNGBDBM50049177((3R,4R)-3,4-Bis-(3,4-dihydroxy-benzyl)-dihydro-fur...)
Affinity DataIC50:  2.14E+4nM. Assay description: Inhibitory concentration of the compound against 3'-processing by HIV -1 Integrase
In DepthDetails ArticlePubMed
TargetAromatase(Homo sapiens (Human))
Johns Hopkins University
Curated by ChEMBL
LigandPNGBDBM50049177((3R,4R)-3,4-Bis-(3,4-dihydroxy-benzyl)-dihydro-fur...)
Affinity DataIC50:  6nM. Assay description: Inhibition of human placental microsome CYP19
In DepthDetails ArticlePubMed
TargetIntegrase(Human immunodeficiency virus 1)
Freie UniversitäT Berlin
Curated by ChEMBL
LigandPNGBDBM50049177((3R,4R)-3,4-Bis-(3,4-dihydroxy-benzyl)-dihydro-fur...)
Affinity DataIC50:  5.40E+3nM. Assay description: Inhibitory concentration of the compound against Strand transfer by HIV -1 Integrase
In DepthDetails ArticlePubMed