BDBM50049212 4'-(2-Cyclopropyl-7-methyl-imidazo[4,5-b]pyridin-3-ylmethyl)-biphenyl-2-carboxylic acid::CHEMBL71162::E-4177
SMILES Cc1ccnc2n(Cc3ccc(cc3)-c3ccccc3C(O)=O)c(nc12)C1CC1
InChI Key InChIKey=VWWMGPCUZVOLLK-UHFFFAOYSA-N
Data  1 Kd
  Tab Delimited (TSV)   2D SDfile   Computed 3D by Vconf -m prep SDfile
Find this compound or compounds like it in BindingDB:
Activity Spreadsheet -- Enzyme Inhibition Constant Data from BindingDB
Found 1 hit for monomerid = 50049212
TargetType-1 angiotensin II receptor(RABBIT)
The M. S. University Of Baroda
Curated by ChEMBL
LigandPNGBDBM50049212(4'-(2-Cyclopropyl-7-methyl-imidazo[4,5-b]pyridin-3...)
Affinity DataKd:  2nM. Assay description: Antagonist activity at angiotensin AT1 receptor in rabbit aorta
In DepthDetails ArticlePubMed