BDBM50049426 CHEMBL3356082
SMILES CC(C)C[C@H](NC(=O)[C@H](Cc1ccccc1)NC(=O)[C@@H](N)Cc1ccc(O)cc1)C(=O)N[C@@H](Cc1ccccc1)C(=O)N[C@@H](C)C(=O)N1CCC[C@H]1C(=O)N[C@@H](CCCNC(N)=N)C(=O)N[C@@H](CC(N)=O)C(N)=O
InChI Key InChIKey=ODHCNHMXLLLMPG-OLDVANGTSA-N
Data  4 EC50
  Tab Delimited (TSV)   2D SDfile   Computed 3D by Vconf -m prep SDfile
Find this compound or compounds like it in BindingDB:
Activity Spreadsheet -- Enzyme Inhibition Constant Data from BindingDB
Found 4 hits for monomerid = 50049426
TargetNeuromedin-U receptor 1(Mus musculus)
Tokyo University Of Pharmacy And Life Sciences
Curated by ChEMBL
LigandPNGBDBM50049426(CHEMBL3356082)
Affinity DataEC50:  2.41E+3nM. Assay description: Agonist activity at mouse NMUR1 expressed in HEK293 cells by calcium mobilization assay
In DepthDetails ArticlePubMed
TargetNeuromedin-U receptor 2(Homo sapiens (Human))
Vrije Universiteit Brussel
Curated by ChEMBL
LigandPNGBDBM50049426(CHEMBL3356082)
Affinity DataEC50:  391nM. Assay description: Agonist activity at human NMUR2 expressed in HEK293 cells assessed as induction of IP3 levels using myo-[2-3H(N)]-inositol after 60 mins by SPA-based...
In DepthDetails ArticlePubMed
TargetNeuromedin-U receptor 1(Homo sapiens (Human))
Vrije Universiteit Brussel
Curated by ChEMBL
LigandPNGBDBM50049426(CHEMBL3356082)
Affinity DataEC50:  709nM. Assay description: Agonist activity at human NMUR1 expressed in HEK293 cells assessed as induction of IP3 levels using myo-[2-3H(N)]-inositol after 60 mins by SPA-based...
In DepthDetails ArticlePubMed
TargetNeuromedin-U receptor 2(Mus musculus)
Tokyo University Of Pharmacy And Life Sciences
Curated by ChEMBL
LigandPNGBDBM50049426(CHEMBL3356082)
Affinity DataEC50:  156nM. Assay description: Agonist activity at mouse NMUR2 expressed in HEK293 cells by calcium mobilization assay
In DepthDetails ArticlePubMed