BDBM50049561 CHEMBL430950::Naltrexone derivative
SMILES Oc1ccc2C[C@H]3N(CC4CC4)CC[C@@]45[C@@H](Oc1c24)[C@]1(CC[C@@]35O)NC(=O)NC1=O
InChI Key InChIKey=AXFDDKKRVFMVHY-OFAZKWMESA-N
Data  1 IC50
  Tab Delimited (TSV)   2D SDfile   Computed 3D by Vconf -m prep SDfile
Find this compound or compounds like it in BindingDB:
Activity Spreadsheet -- Enzyme Inhibition Constant Data from BindingDB
Found 1 hit for monomerid = 50049561
TargetMu-type opioid receptor(GUINEA PIG)
University Of Minnesota
Curated by ChEMBL
LigandPNGBDBM50049561(CHEMBL430950 | Naltrexone derivative)
Affinity DataIC50:  71nM. Assay description: Opioid receptor mu 1 antagonistic activity in guinea pig ileum
In DepthDetails ArticlePubMed