BDBM50049565 CHEMBL295961::Methyl-quinazolin-7-yl-amine
SMILES CNc1ccc2cncnc2c1
InChI Key InChIKey=RCKARIZPXGPJSH-UHFFFAOYSA-N
Data  1 IC50
  Tab Delimited (TSV)   2D SDfile   Computed 3D by Vconf -m prep SDfile
Find this compound or compounds like it in BindingDB:
Activity Spreadsheet -- Enzyme Inhibition Constant Data from BindingDB
Found 1 hit for monomerid = 50049565
TargetEpidermal growth factor receptor(Homo sapiens (Human))
University Of Auckland
LigandPNGBDBM50049565(CHEMBL295961 | Methyl-quinazolin-7-yl-amine)
Affinity DataIC50:  4nM. Assay description: Inhibitory potency against isolated epidermal growth factor receptor (EGFR) from human A431 carcinoma cells
In DepthDetails ArticlePubMed