BDBM50049568 7-Methoxy-quinazoline::CHEMBL300491
SMILES COc1ccc2cncnc2c1
InChI Key InChIKey=CHRMMMLUWHPZAH-UHFFFAOYSA-N
Data  1 IC50
  Tab Delimited (TSV)   2D SDfile   Computed 3D by Vconf -m prep SDfile
Find this compound or compounds like it in BindingDB:
Activity Spreadsheet -- Enzyme Inhibition Constant Data from BindingDB
Found 1 hit for monomerid = 50049568
TargetEpidermal growth factor receptor(Homo sapiens (Human))
University Of Auckland
LigandPNGBDBM50049568(7-Methoxy-quinazoline | CHEMBL300491)
Affinity DataIC50:  10nM. Assay description: Inhibitory potency against isolated epidermal growth factor receptor (EGFR) from human A431 carcinoma cells
In DepthDetails ArticlePubMed