BDBM50049629 4''''-Chloro-4-methanesulfonyl-[1,1'';2'',1'''']terphenyl::4''-Chloro-4-methanesulfonyl-[1,1';2',1'']terphenyl::4-Chloro-4''-methanesulfonyl-[1,1';2',1'']terphenyl::CHEMBL55188
SMILES CS(=O)(=O)c1ccc(cc1)-c1ccccc1-c1ccc(Cl)cc1
InChI Key InChIKey=XDXUQXVTDMNRFB-UHFFFAOYSA-N
Data  4 IC50
  Tab Delimited (TSV)   2D SDfile   Computed 3D by Vconf -m prep SDfile
Find this compound or compounds like it in BindingDB:
Activity Spreadsheet -- Enzyme Inhibition Constant Data from BindingDB
Found 4 hits for monomerid = 50049629
TargetProstaglandin G/H synthase 1(Homo sapiens (Human))
Searle Research And Development
Curated by ChEMBL
LigandPNGBDBM50049629(4''''-Chloro-4-methanesulfonyl-[1,1'';2'',1'''']te...)
Affinity DataIC50: >1.00E+5nM. Assay description: In vitro inhibitory activity against human recombinant prostaglandin G/H synthase 1.
In DepthDetails ArticlePubMed
TargetProstaglandin G/H synthase 2(Homo sapiens (Human))
Universit£
Curated by ChEMBL
LigandPNGBDBM50049629(4''''-Chloro-4-methanesulfonyl-[1,1'';2'',1'''']te...)
Affinity DataIC50:  141nM. Assay description: Inhibition of human Prostaglandin G/H synthase 2
In DepthDetails ArticlePubMed
TargetProstaglandin G/H synthase 2(Homo sapiens (Human))
Universit£
Curated by ChEMBL
LigandPNGBDBM50049629(4''''-Chloro-4-methanesulfonyl-[1,1'';2'',1'''']te...)
Affinity DataIC50:  141nM. Assay description: Binding affinity for Prostaglandin G/H synthase 2 (COX-2)
In DepthDetails ArticlePubMed
TargetProstaglandin G/H synthase 2(Homo sapiens (Human))
Universit£
Curated by ChEMBL
LigandPNGBDBM50049629(4''''-Chloro-4-methanesulfonyl-[1,1'';2'',1'''']te...)
Affinity DataIC50:  140nM. Assay description: In vitro inhibitory activity against human recombinant prostaglandin G/H synthase 2
In DepthDetails ArticlePubMed